BDBM50294779 CHEMBL550036::N-Adamantan-2-yl-3,3-dimethyl-4-(3-pyridin-2-yl-[1,2,4]oxadiazol-5-yl)-butyramide
SMILES CC(C)(CC(=O)NC1C2CC3CC(C2)CC1C3)Cc1nc(no1)-c1ccccn1
InChI Key InChIKey=GAONNMVXNFBDLU-UHFFFAOYSA-N
Data  1 IC50
  Tab Delimited (TSV)   2D SDfile   Computed 3D by Vconf -m prep SDfile
Find this compound or compounds like it in BindingDB:
Activity Spreadsheet -- Enzyme Inhibition Constant Data from BindingDB
Found 1 hit for monomerid = 50294779
Target11-beta-hydroxysteroid dehydrogenase 1(Homo sapiens (Human))
Merck Serono
Curated by ChEMBL
LigandPNGBDBM50294779(CHEMBL550036 | N-Adamantan-2-yl-3,3-dimethyl-4-(3-...)
Affinity DataIC50:  57nM. Assay description: Inhibition of human recombinant 11beta-HSD1 expressed in Escherichia coli assessed as cortisol level after 150 mins by HTRF assay
In DepthDetails ArticlePubMed