BDBM50294822 4-((1R,2S,6R,7S)-3,5-Dioxo-4-aza-tricyclo[5.2.1.0*2,6*]dec-8-en-4-yl)-3-methoxy-N-quinolin-8-yl-benzamide::CHEMBL549766
SMILES COc1cc(ccc1-n1c(O)c2[C@H]3C[C@H](C=C3)c2c1O)C(=O)Nc1cccc2cccnc12
InChI Key InChIKey=QPNRCHGMNOSVTL-IYBDPMFKSA-N
Data  1 EC50
  Tab Delimited (TSV)   2D SDfile   Computed 3D by Vconf -m prep SDfile
Find this compound or compounds like it in BindingDB:
Activity Spreadsheet -- Enzyme Inhibition Constant Data from BindingDB
Found 1 hit for monomerid = 50294822
TargetProto-oncogene Wnt-3(Homo sapiens (Human))
The University Of Texas Southwestern Medical Center At Dallas
Curated by ChEMBL
LigandPNGBDBM50294822(4-((1R,2S,6R,7S)-3,5-Dioxo-4-aza-tricyclo[5.2.1.0*...)
Affinity DataEC50: >2.50E+4nM. Assay description: Inhibition of Wnt3 expressed in mouse L-cells assessed as inhibition of Wnt/catanin signaling pathway by luciferase reporter gene assay
In DepthDetails ArticlePubMed