BDBM50295051 (E)-6-Nitrooctadec-5-enoic Acid::CHEMBL569372
SMILES CCCCCCCCCCCC\C(=C/CCCC(O)=O)[N+]([O-])=O
InChI Key InChIKey=ZNCCLONFJQTFGL-BMRADRMJSA-N
Data  2 IC50
  Tab Delimited (TSV)   2D SDfile   Computed 3D by Vconf -m prep SDfile
Find this compound or compounds like it in BindingDB:
Activity Spreadsheet -- Enzyme Inhibition Constant Data from BindingDB
Found 2 hits for monomerid = 50295051
TargetPeroxisome proliferator-activated receptor alpha(Homo sapiens (Human))
Wake Forest University
Curated by ChEMBL
LigandPNGBDBM50295051((E)-6-Nitrooctadec-5-enoic Acid | CHEMBL569372)
Affinity DataIC50: >1.50E+4nM. Assay description: Displacement of [3H2]nTZD3 from GST-tagged human recombinant PPARalpha by scintillation proximity assay
In DepthDetails ArticlePubMed
TargetPeroxisome proliferator-activated receptor gamma(Homo sapiens (Human))
Wake Forest University
Curated by ChEMBL
LigandPNGBDBM50295051((E)-6-Nitrooctadec-5-enoic Acid | CHEMBL569372)
Affinity DataIC50:  1.72E+3nM. Assay description: Displacement of [3H2]nTZD3 from GST-tagged human recombinant PPARgamma by scintillation proximity assay
In DepthDetails ArticlePubMed