BDBM50295059 (2S)-8-Methyl-2-{[(2S)-2-methyl-4-quinolin-2-ylpiperazin-1-yl]methyl}-2,3-dihydro[1,4]dioxino-[2,3-f]quinoline::CHEMBL565234
SMILES C[C@H]1CN(CCN1C[C@H]1COc2ccc3nc(C)ccc3c2O1)c1ccc2ccccc2n1
InChI Key InChIKey=SZQOJBUUZPJIPU-FPOVZHCZSA-N
Data  2 KI  1 IC50
  Tab Delimited (TSV)   2D SDfile   Computed 3D by Vconf -m prep SDfile
Find this compound or compounds like it in BindingDB:
Activity Spreadsheet -- Enzyme Inhibition Constant Data from BindingDB
Found 3 hits for monomerid = 50295059
TargetSodium-dependent serotonin transporter(Rattus norvegicus (rat))
Wyeth Research
Curated by ChEMBL
LigandPNGBDBM50295059((2S)-8-Methyl-2-{[(2S)-2-methyl-4-quinolin-2-ylpip...)
Affinity DataKi:  10.3nM. Assay description: Displacement of [3H]paroxetine from 5HT transporter in rat cortical membrane
In DepthDetails ArticlePubMed
Target5-hydroxytryptamine receptor 1A(Homo sapiens (Human))
Wyeth Research
Curated by ChEMBL
LigandPNGBDBM50295059((2S)-8-Methyl-2-{[(2S)-2-methyl-4-quinolin-2-ylpip...)
Affinity DataKi:  167nM. Assay description: Displacement of [3H]8-OH-DPAT from human 5HT1A receptor expressed in CHO cells
In DepthDetails ArticlePubMed
Target5-hydroxytryptamine receptor 1A(Homo sapiens (Human))
Wyeth Research
Curated by ChEMBL
LigandPNGBDBM50295059((2S)-8-Methyl-2-{[(2S)-2-methyl-4-quinolin-2-ylpip...)
Affinity DataIC50:  1.90E+3nM. Assay description: Antagonist activity at human 5HT1A receptor expressed in CHO cells assessed as stimulation of [35S]GTPgammaS binding
In DepthDetails ArticlePubMed