BDBM50295221 11-(2-chloro-6-fluorophenyl)-10-ethyl-3,3,8-trimethyl-2,3,4,5,10,11-hexahydro-1H-dibenzo[b,e][1,4]diazepin-1-one::CHEMBL538178
SMILES CCN1C(C2C(=O)CC(C)(C)CC2=Nc2ccc(C)cc12)c1c(F)cccc1Cl
InChI Key InChIKey=IQAPNRIITLPCHN-UHFFFAOYSA-N
Data  1 IC50
  Tab Delimited (TSV)   2D SDfile   Computed 3D by Vconf -m prep SDfile
Find this compound or compounds like it in BindingDB:
Activity Spreadsheet -- Enzyme Inhibition Constant Data from BindingDB
Found 1 hit for monomerid = 50295221
TargetNeuromedin-B receptor(Homo sapiens (Human))
Amgen
Curated by ChEMBL
LigandPNGBDBM50295221(11-(2-chloro-6-fluorophenyl)-10-ethyl-3,3,8-trimet...)
Affinity DataIC50:  180nM. Assay description: Displacement of [125I]-(D-Tyr0)NMB from human neuromedin B receptor transfected in HEK293 cells
In DepthDetails ArticlePubMed