BDBM50295291 (+/-)-trans-3-(2-((ethylamino)methyl)cyclopentyl)-1H-indole-5-carbonitrile::CHEMBL549489
SMILES CCNC[C@H]1CCC[C@@H]1c1c[nH]c2ccc(cc12)C#N
InChI Key InChIKey=LZMRTFCHXJIEEQ-KGLIPLIRSA-N
Data  1 IC50
  Tab Delimited (TSV)   2D SDfile   Computed 3D by Vconf -m prep SDfile
Find this compound or compounds like it in BindingDB:
Activity Spreadsheet -- Enzyme Inhibition Constant Data from BindingDB
Found 1 hit for monomerid = 50295291
TargetSodium-dependent serotonin transporter(Homo sapiens (Human))
Bristol-Myers Squibb Pharmaceutical Research Institute
Curated by ChEMBL
LigandPNGBDBM50295291((+/-)-trans-3-(2-((ethylamino)methyl)cyclopentyl)-...)
Affinity DataIC50:  170nM. Assay description: Displacement of [125I]RTI-55 from human SERT expressed in HEK293 cells
In DepthDetails ArticlePubMed