BDBM50295333 CHEMBL3742313
SMILES Oc1cc(CC2CCCCC2)[nH]c(=O)c1-c1ccccc1
InChI Key InChIKey=UVVRYOIOMHFQGU-UHFFFAOYSA-N
Data  1 IC50  1 Kd
PDB links: 1 PDB ID matches this monomer.
  Tab Delimited (TSV)   2D SDfile   Computed 3D by Vconf -m prep SDfile
Find this compound or compounds like it in BindingDB:
Activity Spreadsheet -- Enzyme Inhibition Constant Data from BindingDB
Found 2 hits for monomerid = 50295333
TargetEnoyl-[acyl-carrier-protein] reductase [NADH](Mycobacterium tuberculosis (strain ATCC 25618 / H3...)
Cnrs
Curated by ChEMBL
LigandPNGBDBM50295333(CHEMBL3742313)
Affinity DataIC50:  590nM. Assay description: Inhibition of Mycobacterium tuberculosis InhA using trans-2-dodecenoyl-CoA as substrate
TargetEnoyl-[acyl-carrier-protein] reductase [NADH](Mycobacterium tuberculosis (strain ATCC 25618 / H3...)
Cnrs
Curated by ChEMBL
LigandPNGBDBM50295333(CHEMBL3742313)
Affinity DataKd:  560nM. Assay description: Binding affinity to Mycobacterium tuberculosis InhA in presence of TCEP and NADH by isothermal titration calorimetry