BDBM50295581 4-chloro-N-(1-(2-(2-fluoro-4-(2-oxopyridin-1(2H)-yl)phenylamino)-2-oxoethyl)-1H-pyrazol-3-yl)cyclopenta-1,3-dienecarboxamide::CHEMBL550586
SMILES Fc1cc(ccc1NC(=O)Cn1ccc(NC(=O)c2ccc(Cl)s2)n1)-n1ccccc1=O
InChI Key InChIKey=POYDZZCFUWXUIM-UHFFFAOYSA-N
Data  1 KI
  Tab Delimited (TSV)   2D SDfile   Computed 3D by Vconf -m prep SDfile
Find this compound or compounds like it in BindingDB:
Activity Spreadsheet -- Enzyme Inhibition Constant Data from BindingDB
Found 1 hit for monomerid = 50295581
TargetCoagulation factor X(Homo sapiens (Human))
F. Hoffmann-La Roche
Curated by ChEMBL
LigandPNGBDBM50295581(4-chloro-N-(1-(2-(2-fluoro-4-(2-oxopyridin-1(2H)-y...)
Affinity DataKi:  6nM. Assay description: Binding affinity to factor 10a
In DepthDetails ArticlePubMed