BDBM50295697 2-(3-aminopropoxy)-N-(4-(3-(diaminomethyleneamino)propoxy)benzyl)-N-(6-(4-hydroxyphenoxy)benzo[d]thiazol-2-yl)benzamide::CHEMBL558314
SMILES [#7]-[#6]-[#6]-[#6]-[#8]-c1ccccc1-[#6](=O)-[#7](-[#6]-c1ccc(-[#8]-[#6]-[#6]-[#6]\[#7]=[#6](\[#7])-[#7])cc1)-c1nc2ccc(-[#8]-c3ccc(-[#8])cc3)cc2s1
InChI Key InChIKey=BLHUKYKUAQAMCB-UHFFFAOYSA-N
Data  2 EC50
  Tab Delimited (TSV)   2D SDfile   Computed 3D by Vconf -m prep SDfile
Find this compound or compounds like it in BindingDB:
Activity Spreadsheet -- Enzyme Inhibition Constant Data from BindingDB
Found 2 hits for monomerid = 50295697
TargetVoltage-dependent N-type calcium channel subunit alpha-1B(Rattus norvegicus (Rat))
Iitb-Monash Research Academy
Curated by ChEMBL
LigandPNGBDBM50295697(2-(3-aminopropoxy)-N-(4-(3-(diaminomethyleneamino)...)
Affinity DataEC50:  5.70E+3nM. Assay description: Displacement of [125I]GVIA from rat brain membrane Cav2.2 after 1 hr by gamma counting method
In DepthDetails ArticlePubMed
TargetVoltage-dependent N-type calcium channel subunit alpha-1B(Rattus norvegicus (Rat))
Iitb-Monash Research Academy
Curated by ChEMBL
LigandPNGBDBM50295697(2-(3-aminopropoxy)-N-(4-(3-(diaminomethyleneamino)...)
Affinity DataEC50:  1.78E+3nM. Assay description: Inhibition of rat neuronal Cav2.2 channel
In DepthDetails ArticlePubMed