BDBM50296167 2-chloro-N-(2,6-dimethylphenyl)-N-(2-morpholino-2-(4-nitrophenyl)acetyl)benzamide::CHEMBL557442
SMILES Cc1cccc(C)c1N(C(=O)C(N1CCOCC1)c1ccc(cc1)[N+]([O-])=O)C(=O)c1ccccc1Cl
InChI Key InChIKey=LRWQOJYFZBJAOO-UHFFFAOYSA-N
Data  1 KI
  Tab Delimited (TSV)   2D SDfile   Computed 3D by Vconf -m prep SDfile
Find this compound or compounds like it in BindingDB:
Activity Spreadsheet -- Enzyme Inhibition Constant Data from BindingDB
Found 1 hit for monomerid = 50296167
TargetCannabinoid receptor 1(Homo sapiens (Human))
Vernalis (R&D)
Curated by ChEMBL
LigandPNGBDBM50296167(2-chloro-N-(2,6-dimethylphenyl)-N-(2-morpholino-2-...)
Affinity DataKi:  2.79E+3nM. Assay description: Displacement of [3H]rimonabant from human CB1 receptor expressed in HEK293 cells by liquid scintillation counting
In DepthDetails ArticlePubMed