BDBM50296492 (11R,12R)-12-azaniumyl-4-methyl-11-(2,4,5-trifluorophenyl)-1,5,8-triazatricyclo[7.4.0.0^{2,7}]trideca-2(7),3,5,8-tetraen-5-ium; bis(2,2,2-trifluoroacetate)::CHEMBL557514
SMILES Cc1cc2[n+]3C[C@H]([NH3+])[C@H](Cc3[nH]c2cn1)c1cc(F)c(F)cc1F
InChI Key InChIKey=ZKIQXZCIJWYYJX-YGRLFVJLSA-P
Data  4 IC50
  Tab Delimited (TSV)   2D SDfile   Computed 3D by Vconf -m prep SDfile
Find this compound or compounds like it in BindingDB:
Activity Spreadsheet -- Enzyme Inhibition Constant Data from BindingDB
Found 4 hits for monomerid = 50296492
TargetDipeptidyl peptidase 4(Homo sapiens (Human))
Merck
Curated by ChEMBL
LigandPNGBDBM50296492((11R,12R)-12-azaniumyl-4-methyl-11-(2,4,5-trifluor...)
Affinity DataIC50:  23nM. Assay description: Inhibition of human recombinant DPP4
In DepthDetails ArticlePubMed
TargetDipeptidyl peptidase 9(Homo sapiens (Human))
Merck
Curated by ChEMBL
LigandPNGBDBM50296492((11R,12R)-12-azaniumyl-4-methyl-11-(2,4,5-trifluor...)
Affinity DataIC50:  4.70E+4nM. Assay description: Inhibition of human DPP9 expressed in baculovirus by continuous fluorescent assay
In DepthDetails ArticlePubMed
TargetDipeptidyl peptidase 8(Homo sapiens (Human))
Merck
Curated by ChEMBL
LigandPNGBDBM50296492((11R,12R)-12-azaniumyl-4-methyl-11-(2,4,5-trifluor...)
Affinity DataIC50:  2.40E+4nM. Assay description: Inhibition of human DPP8 expressed in baculovirus by continuous fluorescent assay
In DepthDetails ArticlePubMed
TargetDipeptidyl peptidase 2(Homo sapiens (Human))
Merck
Curated by ChEMBL
LigandPNGBDBM50296492((11R,12R)-12-azaniumyl-4-methyl-11-(2,4,5-trifluor...)
Affinity DataIC50:  4.90E+4nM. Assay description: Inhibition of human recombinant QPP transfected in insect SF9 cells
In DepthDetails ArticlePubMed