BDBM50296533 3-(4-methoxyphenyl)-N-(5-(3-(trifluoromethyl)benzyl)thiazol-2-yl)acrylamide::CHEMBL560271
SMILES COc1ccc(\C=C\C(=O)Nc2ncc(Cc3cccc(c3)C(F)(F)F)s2)cc1
InChI Key InChIKey=CRHNKCHJUAWGHN-JXMROGBWSA-N
Data  2 IC50
  Tab Delimited (TSV)   2D SDfile   Computed 3D by Vconf -m prep SDfile
Find this compound or compounds like it in BindingDB:
Activity Spreadsheet -- Enzyme Inhibition Constant Data from BindingDB
Found 2 hits for monomerid = 50296533
TargetStearoyl-CoA desaturase(Homo sapiens (Human))
Daiichi Sankyo
Curated by ChEMBL
LigandPNGBDBM50296533(3-(4-methoxyphenyl)-N-(5-(3-(trifluoromethyl)benzy...)
Affinity DataIC50:  3nM. Assay description: Inhibition of SCD1 in human microsomes assessed as conversion of [14C]stearate to [14C]oleate after 60 mins
In DepthDetails ArticlePubMed
TargetAcyl-CoA desaturase 1(Mus musculus)
Daiichi Sankyo
Curated by ChEMBL
LigandPNGBDBM50296533(3-(4-methoxyphenyl)-N-(5-(3-(trifluoromethyl)benzy...)
Affinity DataIC50:  2nM. Assay description: Inhibition of SCD1 in mouse microsomes assessed as conversion of [14C]stearate to [14C]oleate after 60 mins
In DepthDetails ArticlePubMed