BDBM50296632 (R)-3-(2-methoxybenzamido)-2-(2,4,6-trimethylphenylsulfonamido)propanoic acid::CHEMBL560928
SMILES COc1ccccc1C(=O)NC[C@@H](NS(=O)(=O)c1c(C)cc(C)cc1C)C(O)=O
InChI Key InChIKey=OVMMVMYICJMMRY-MRXNPFEDSA-N
Data  1 IC50
  Tab Delimited (TSV)   2D SDfile   Computed 3D by Vconf -m prep SDfile
Find this compound or compounds like it in BindingDB:
Activity Spreadsheet -- Enzyme Inhibition Constant Data from BindingDB
Found 1 hit for monomerid = 50296632
TargetIntegrin alpha-V(Homo sapiens (Human))
Astrazeneca
Curated by ChEMBL
LigandPNGBDBM50296632((R)-3-(2-methoxybenzamido)-2-(2,4,6-trimethylpheny...)
Affinity DataIC50:  78nM. Assay description: Inhibition of fibrinogen binding to alphavbeta3 integrin
In DepthDetails ArticlePubMed