BDBM50296728 3-fluorophenyl 1,4-diazabicyclo[3.2.2]nonane-4-carboxylate::CHEMBL553484
SMILES Fc1cccc(OC(=O)N2CCN3CCC2CC3)c1
InChI Key InChIKey=IKNIMCPSNFXNTK-UHFFFAOYSA-N
Data  1 KI  1 IC50
  Tab Delimited (TSV)   2D SDfile   Computed 3D by Vconf -m prep SDfile
Find this compound or compounds like it in BindingDB:
Activity Spreadsheet -- Enzyme Inhibition Constant Data from BindingDB
Found 2 hits for monomerid = 50296728
TargetNeuronal acetylcholine receptor subunit alpha-7(Rattus norvegicus (Rat))
Pfizer
Curated by ChEMBL
LigandPNGBDBM50296728(3-fluorophenyl 1,4-diazabicyclo[3.2.2]nonane-4-car...)
Affinity DataKi:  35nM. Assay description: Displacement of [125I]BTX from rat alpha7 nAChR expressed in rat GH4C1 cells
In DepthDetails ArticlePubMed
TargetNeuronal acetylcholine receptor subunit alpha-4(Rattus norvegicus (Rat))
Pfizer
Curated by ChEMBL
LigandPNGBDBM50296728(3-fluorophenyl 1,4-diazabicyclo[3.2.2]nonane-4-car...)
Affinity DataIC50:  1.07E+3nM. Assay description: Displacement of L-[3H]Nicotine from alpha4beta2 nAChR in rat brain homogenate by rapid filtration method
In DepthDetails ArticlePubMed