BDBM50296813 2-(2-(2-(dimethylamino)ethylamino)pyridin-3-yl)-5-methyl-4H-benzo[d][1,3]oxazin-4-one::CHEMBL551606
SMILES CN(C)CCNc1ncccc1-c1nc2cccc(C)c2c(=O)o1
InChI Key InChIKey=PPWHPFPLUVQVDH-UHFFFAOYSA-N
Data  1 IC50
  Tab Delimited (TSV)   2D SDfile   Computed 3D by Vconf -m prep SDfile
Find this compound or compounds like it in BindingDB:
Activity Spreadsheet -- Enzyme Inhibition Constant Data from BindingDB
Found 1 hit for monomerid = 50296813
TargetNeutrophil elastase(Homo sapiens (Human))
Activx Biosciences
Curated by ChEMBL
LigandPNGBDBM50296813(2-(2-(2-(dimethylamino)ethylamino)pyridin-3-yl)-5-...)
Affinity DataIC50:  8.10E+3nM. Assay description: Inhibition of human sputum neutrophil elastase by fluorescence based assay
In DepthDetails ArticlePubMed