BDBM50296857 2-(1-(3,4-dichlorophenylsulfonyl)-2-methyl-1H-pyrrolo[2,3-b]pyridin-3-yl)acetic acid::CHEMBL560279
SMILES Cc1c(CC(O)=O)c2cccnc2n1S(=O)(=O)c1ccc(Cl)c(Cl)c1
InChI Key InChIKey=GSZRZMZTHWSNFG-UHFFFAOYSA-N
Data  1 KI  3 IC50
  Tab Delimited (TSV)   2D SDfile   Computed 3D by Vconf -m prep SDfile
Find this compound or compounds like it in BindingDB:
Activity Spreadsheet -- Enzyme Inhibition Constant Data from BindingDB
Found 4 hits for monomerid = 50296857
TargetProstaglandin D2 receptor 2(Homo sapiens (Human))
Novartis Institutes Of Biomedical Research
Curated by ChEMBL
LigandPNGBDBM50296857(2-(1-(3,4-dichlorophenylsulfonyl)-2-methyl-1H-pyrr...)
Affinity DataKi:  52nM. Assay description: Displacement of [3H]PGD2 from human CRTh2 receptor expressed in CHO cells
In DepthDetails ArticlePubMed
TargetProstaglandin D2 receptor 2(Homo sapiens (Human))
Novartis Institutes Of Biomedical Research
Curated by ChEMBL
LigandPNGBDBM50296857(2-(1-(3,4-dichlorophenylsulfonyl)-2-methyl-1H-pyrr...)
Affinity DataIC50:  629nM. Assay description: Antagonist activity against CRTh2 receptor in human whole blood assessed as eosinophil shape change
In DepthDetails ArticlePubMed
TargetProstaglandin D2 receptor 2(Homo sapiens (Human))
Novartis Institutes Of Biomedical Research
Curated by ChEMBL
LigandPNGBDBM50296857(2-(1-(3,4-dichlorophenylsulfonyl)-2-methyl-1H-pyrr...)
Affinity DataIC50:  354nM. Assay description: Antagonist activity against human CRTh2 receptor expressed in CHO cells assessed as effect on cAMP accumulation
In DepthDetails ArticlePubMed
TargetProstaglandin D2 receptor 2(Homo sapiens (Human))
Novartis Institutes Of Biomedical Research
Curated by ChEMBL
LigandPNGBDBM50296857(2-(1-(3,4-dichlorophenylsulfonyl)-2-methyl-1H-pyrr...)
Affinity DataIC50:  112nM. Assay description: Antagonist activity against CRTh2 receptor in human eosinophils assessed as cell shape change
In DepthDetails ArticlePubMed