BDBM50296967 3-(cyclohexyloxy)-4'-(2-((1R,2S)-1-hydroxy-1-(4-hydroxyphenyl)propan-2-ylamino)ethyl)-N-(methylsulfonyl)biphenyl-4-carboxamide::CHEMBL557253
SMILES C[C@H](NCCc1ccc(cc1)-c1ccc(C(=O)NS(C)(=O)=O)c(OC2CCCCC2)c1)[C@H](O)c1ccc(O)cc1
InChI Key InChIKey=PDNUKEKZGRGQLD-JRPXNJEYSA-N
Data  3 EC50
  Tab Delimited (TSV)   2D SDfile   Computed 3D by Vconf -m prep SDfile
Find this compound or compounds like it in BindingDB:
Activity Spreadsheet -- Enzyme Inhibition Constant Data from BindingDB
Found 3 hits for monomerid = 50296967
TargetBeta-2 adrenergic receptor(Homo sapiens (Human))
Astellas Pharma
Curated by ChEMBL
LigandPNGBDBM50296967(3-(cyclohexyloxy)-4'-(2-((1R,2S)-1-hydroxy-1-(4-hy...)
Affinity DataEC50: >1.00E+4nM. Assay description: Agonist activity at human recombinant adrenergic beta2 receptor expressed in CHO cells assessed as stimulation of cAMP level after 1 hr by enzyme imm...
In DepthDetails ArticlePubMed
TargetBeta-1 adrenergic receptor(Homo sapiens (Human))
Astellas Pharma
Curated by ChEMBL
LigandPNGBDBM50296967(3-(cyclohexyloxy)-4'-(2-((1R,2S)-1-hydroxy-1-(4-hy...)
Affinity DataEC50:  110nM. Assay description: Agonist activity at human recombinant adrenergic beta-1 receptor expressed in CHO cells assessed as stimulation of cAMP level after 1 hr by enzyme im...
In DepthDetails ArticlePubMed
TargetBeta-3 adrenergic receptor(Homo sapiens (Human))
Astellas Pharma
Curated by ChEMBL
LigandPNGBDBM50296967(3-(cyclohexyloxy)-4'-(2-((1R,2S)-1-hydroxy-1-(4-hy...)
Affinity DataEC50:  0.350nM. Assay description: Agonist activity at human recombinant adrenergic beta3 receptor expressed in CHO cells assessed as stimulation of cAMP level after 1 hr by enzyme imm...
In DepthDetails ArticlePubMed