BDBM50297116 (R)-3-(3-Methoxy-phenyl)-10-methyl-9,10,11,12-tetrahydro-7-thia-4,9,12-triaza-naphtho[1,2-a]azulen-8-one::CHEMBL563307
SMILES COc1cccc(c1)-c1ccc2c3c4NC[C@@H](C)NC(=O)c4sc3ccc2n1
InChI Key InChIKey=IKAZZNSWVQMULP-GFCCVEGCSA-N
Data  3 IC50
  Tab Delimited (TSV)   2D SDfile   Computed 3D by Vconf -m prep SDfile
Find this compound or compounds like it in BindingDB:
Activity Spreadsheet -- Enzyme Inhibition Constant Data from BindingDB
Found 3 hits for monomerid = 50297116
TargetMAP kinase-activated protein kinase 2(Homo sapiens (Human))
Pfizer
Curated by ChEMBL
LigandPNGBDBM50297116((R)-3-(3-Methoxy-phenyl)-10-methyl-9,10,11,12-tetr...)
Affinity DataIC50:  690nM. Assay description: Inhibition of MK2 in human U937 cells assessed as blockade of LPS-stimulated TNFalpha production
In DepthDetails ArticlePubMed
TargetCyclin-dependent kinase 1(Homo sapiens (Human))
Pfizer
Curated by ChEMBL
LigandPNGBDBM50297116((R)-3-(3-Methoxy-phenyl)-10-methyl-9,10,11,12-tetr...)
Affinity DataIC50:  2.04E+3nM. Assay description: Inhibition of CDK2
In DepthDetails ArticlePubMed
TargetMAP kinase-activated protein kinase 2(Homo sapiens (Human))
Pfizer
Curated by ChEMBL
LigandPNGBDBM50297116((R)-3-(3-Methoxy-phenyl)-10-methyl-9,10,11,12-tetr...)
Affinity DataIC50:  41nM. Assay description: Inhibition of MK2
In DepthDetails ArticlePubMed