BDBM50297117 (R)-3-(2-Fluoro-phenyl)-10-methyl-9,10,11,12-tetrahydro-7-thia-4,9,12-triaza-naphtho[1,2-a]azulen-8-one::CHEMBL554286
SMILES C[C@@H]1CNc2c(sc3ccc4nc(ccc4c23)-c2ccccc2F)C(=O)N1
InChI Key InChIKey=TXYQKEJLINYOCR-LLVKDONJSA-N
Data  3 IC50
  Tab Delimited (TSV)   2D SDfile   Computed 3D by Vconf -m prep SDfile
Find this compound or compounds like it in BindingDB:
Activity Spreadsheet -- Enzyme Inhibition Constant Data from BindingDB
Found 3 hits for monomerid = 50297117
TargetMAP kinase-activated protein kinase 2(Homo sapiens (Human))
Pfizer
Curated by ChEMBL
LigandPNGBDBM50297117((R)-3-(2-Fluoro-phenyl)-10-methyl-9,10,11,12-tetra...)
Affinity DataIC50:  930nM. Assay description: Inhibition of MK2 in human U937 cells assessed as blockade of LPS-stimulated TNFalpha production
In DepthDetails ArticlePubMed
TargetCyclin-dependent kinase 1(Homo sapiens (Human))
Pfizer
Curated by ChEMBL
LigandPNGBDBM50297117((R)-3-(2-Fluoro-phenyl)-10-methyl-9,10,11,12-tetra...)
Affinity DataIC50:  1.09E+4nM. Assay description: Inhibition of CDK2
In DepthDetails ArticlePubMed
TargetMAP kinase-activated protein kinase 2(Homo sapiens (Human))
Pfizer
Curated by ChEMBL
LigandPNGBDBM50297117((R)-3-(2-Fluoro-phenyl)-10-methyl-9,10,11,12-tetra...)
Affinity DataIC50:  14nM. Assay description: Inhibition of MK2
In DepthDetails ArticlePubMed