BDBM50297189 2-(1-Acetylpiperidin-4-ylidene)-N-{(3R)-1-[(6-fluoro-2-naphthyl)methyl]pyrrolidin-3-yl}acetamide::CHEMBL550255
SMILES [#6]-[#6](=O)-[#7]-1-[#6]-[#6]\[#6](-[#6]-[#6]-1)=[#6]/[#6](=O)-[#7]-[#6@@H]-1-[#6]-[#6]-[#7](-[#6]-c2ccc3cc(F)ccc3c2)-[#6]-1
InChI Key InChIKey=VSVSVIPQECPZMU-HSZRJFAPSA-N
Data  1 IC50
  Tab Delimited (TSV)   2D SDfile   Computed 3D by Vconf -m prep SDfile
Find this compound or compounds like it in BindingDB:
Activity Spreadsheet -- Enzyme Inhibition Constant Data from BindingDB
Found 1 hit for monomerid = 50297189
TargetC-C chemokine receptor type 3(Homo sapiens (Human))
Astellas Pharma
Curated by ChEMBL
LigandPNGBDBM50297189(2-(1-Acetylpiperidin-4-ylidene)-N-{(3R)-1-[(6-fluo...)
Affinity DataIC50:  160nM. Assay description: Antagonist activity at human CCR3 expressed in mouse B300-19 cells assessed as inhibition of eotaxin-induced calcium flux
In DepthDetails ArticlePubMed