BDBM50297311 CHEMBL551340::Dimethyl-[2-(3-pyrazin-2-ylmethyl-benzo[b]thiophen-2-yl)-ethyl]-amine
SMILES CN(C)CCc1sc2ccccc2c1Cc1cnccn1
InChI Key InChIKey=QWTQKWHOWDAFRM-UHFFFAOYSA-N
Data  1 KI
  Tab Delimited (TSV)   2D SDfile   Computed 3D by Vconf -m prep SDfile
Find this compound or compounds like it in BindingDB:
Activity Spreadsheet -- Enzyme Inhibition Constant Data from BindingDB
Found 1 hit for monomerid = 50297311
TargetHistamine H1 receptor(Homo sapiens (Human))
Neurocrine Biosciences
Curated by ChEMBL
LigandPNGBDBM50297311(CHEMBL551340 | Dimethyl-[2-(3-pyrazin-2-ylmethyl-b...)
Affinity DataKi:  75nM. Assay description: Displacement of [3H]pyrilamine from human histamine H1 receptor expressed in CHO Flp-In cells by liquid scintillation counting
In DepthDetails ArticlePubMed