BDBM50297434 3-(4-methoxyphenyl)-N-phenyl-5-(thiophen-2-yl)-4,5-dihydro-1H-pyrazole-1-carbothioamide::CHEMBL550409
SMILES COc1ccc(cc1)C1=NN(C(C1)c1cccs1)C(=S)Nc1ccccc1
InChI Key InChIKey=XDXREFQWXCJOGA-UHFFFAOYSA-N
Data  1 IC50
  Tab Delimited (TSV)   2D SDfile   Computed 3D by Vconf -m prep SDfile
Find this compound or compounds like it in BindingDB:
Activity Spreadsheet -- Enzyme Inhibition Constant Data from BindingDB
Found 1 hit for monomerid = 50297434
TargetAmine oxidase [flavin-containing] B(Homo sapiens (Human))
Gvk Biosciences
Curated by ChEMBL
LigandPNGBDBM50297434(3-(4-methoxyphenyl)-N-phenyl-5-(thiophen-2-yl)-4,5...)
Affinity DataIC50:  9.20E+4nM. Assay description: Inhibition of MAOB
In DepthDetails ArticlePubMed