BDBM50297468 1-((6-fluoro-4H-benzo[d][1,3]dioxin-8-yl)methyl)-3-(hydroxyimino)indolin-2-one::CHEMBL552487
SMILES Fc1cc(CN2C(=O)C(N=O)c3ccccc23)c2OCOCc2c1
InChI Key InChIKey=KNCGNJQWPKBRPB-UHFFFAOYSA-N
Data  1 KI
  Tab Delimited (TSV)   2D SDfile   Computed 3D by Vconf -m prep SDfile
Find this compound or compounds like it in BindingDB:
Activity Spreadsheet -- Enzyme Inhibition Constant Data from BindingDB
Found 1 hit for monomerid = 50297468
TargetMitogen-activated protein kinase 10(Homo sapiens (Human))
Vertex Pharmaceuticals
Curated by ChEMBL
LigandPNGBDBM50297468(1-((6-fluoro-4H-benzo[d][1,3]dioxin-8-yl)methyl)-3...)
Affinity DataKi:  510nM. Assay description: Inhibition of JNK3 by spectrophotometric coupled enzyme assay
In DepthDetails ArticlePubMed