BDBM50297515 6-[2-(4-Hydroxy-phenyl)-propyl]-pyridin-3-ol::CHEMBL539220
SMILES CC(Cc1ccc(O)cn1)c1ccc(O)cc1
InChI Key InChIKey=GSIJQGLPYGIKTC-UHFFFAOYSA-N
Data  2 EC50
  Tab Delimited (TSV)   2D SDfile   Computed 3D by Vconf -m prep SDfile
Find this compound or compounds like it in BindingDB:
Activity Spreadsheet -- Enzyme Inhibition Constant Data from BindingDB
Found 2 hits for monomerid = 50297515
TargetEstrogen receptor beta(Homo sapiens (Human))
University Of Illinois
Curated by ChEMBL
LigandPNGBDBM50297515(6-[2-(4-Hydroxy-phenyl)-propyl]-pyridin-3-ol | CHE...)
Affinity DataEC50:  170nM. Assay description: Activity at human ERbeta expressed in HEC1 cells cotransfected with 2ERE-pS2-Luc assessed as relative transcriptional potency by luciferase reporter ...
In DepthDetails ArticlePubMed
TargetEstrogen receptor(Homo sapiens (Human))
University Of Illinois
Curated by ChEMBL
LigandPNGBDBM50297515(6-[2-(4-Hydroxy-phenyl)-propyl]-pyridin-3-ol | CHE...)
Affinity DataEC50:  440nM. Assay description: Activity at human ERalpha expressed in HEC1 cells cotransfected with 2ERE-pS2-Luc assessed as relative transcriptional potency by luciferase reporter...
In DepthDetails ArticlePubMed