BDBM50297524 (S)-1,2-dihydroxydecane-3,4-dione::CHEMBL550518
SMILES CCCCCCC(O)C(=O)C(=O)CO
InChI Key InChIKey=RPNHIVHWEBDSAP-UHFFFAOYSA-N
Data  1 EC50
  Tab Delimited (TSV)   2D SDfile   Computed 3D by Vconf -m prep SDfile
Find this compound or compounds like it in BindingDB:
Activity Spreadsheet -- Enzyme Inhibition Constant Data from BindingDB
Found 1 hit for monomerid = 50297524
TargetAutoinducer 2-binding periplasmic protein LuxP(Vibrio harveyi)
Ben-Gurion University Of The Negev
Curated by ChEMBL
LigandPNGBDBM50297524((S)-1,2-dihydroxydecane-3,4-dione | CHEMBL550518)
Affinity DataEC50:  1.52E+3nM. Assay description: Agonist activity at Vibrio harveyi BB170 LuxP assessed as inhibition of autoinducer-2-induced quorum sensing after 5 hrs by luminescence assay
In DepthDetails ArticlePubMed