BDBM50297615 (R)-3-hydroxy-N-(1-((1-(4-(trifluoromethyl)phenyl)-1H-pyrrol-3-yl)methyl)piperidin-4-yl)pyrrolidine-1-carboxamide::CHEMBL551826
SMILES O[C@@H]1CCN(C1)C(=O)NC1CCN(Cc2ccn(c2)-c2ccc(cc2)C(F)(F)F)CC1
InChI Key InChIKey=CTRFGUFUXSJXQG-HXUWFJFHSA-N
Data  2 IC50
  Tab Delimited (TSV)   2D SDfile   Computed 3D by Vconf -m prep SDfile
Find this compound or compounds like it in BindingDB:
Activity Spreadsheet -- Enzyme Inhibition Constant Data from BindingDB
Found 2 hits for monomerid = 50297615
TargetMelanin-concentrating hormone receptor 1(Homo sapiens (Human))
Astrazeneca R & D M£Lndal
Curated by ChEMBL
LigandPNGBDBM50297615((R)-3-hydroxy-N-(1-((1-(4-(trifluoromethyl)phenyl)...)
Affinity DataIC50:  138nM. Assay description: Displacement of [125I]MCH from human MCH1 receptor expressed in HEK293 cells
In DepthDetails ArticlePubMed
TargetPotassium voltage-gated channel subfamily H member 2(Homo sapiens (Human))
Astrazeneca R & D M£Lndal
Curated by ChEMBL
LigandPNGBDBM50297615((R)-3-hydroxy-N-(1-((1-(4-(trifluoromethyl)phenyl)...)
Affinity DataIC50: >3.16E+4nM. Assay description: Inhibition of human ERG expressed in CHO cells by patch-clamp assay
In DepthDetails ArticlePubMed