BDBM50298015 CHEMBL559497::N-((3-(3-fluoro-4-hydroxyphenyl)-4,5-dihydroisoxazol-5-yl)methyl)pivalamide
SMILES CC(C)(C)C(=O)NCC1CC(=NO1)c1ccc(O)c(F)c1
InChI Key InChIKey=XVCZEEJHXIXSLJ-UHFFFAOYSA-N
Data  1 IC50
  Tab Delimited (TSV)   2D SDfile   Computed 3D by Vconf -m prep SDfile
Find this compound or compounds like it in BindingDB:
Activity Spreadsheet -- Enzyme Inhibition Constant Data from BindingDB
Found 1 hit for monomerid = 50298015
TargetMacrophage migration inhibitory factor(Homo sapiens (Human))
Piramal Life Sciences
Curated by ChEMBL
LigandPNGBDBM50298015(CHEMBL559497 | N-((3-(3-fluoro-4-hydroxyphenyl)-4,...)
Affinity DataIC50: >1.00E+5nM. Assay description: Inhibition of dopachrome tautomerase activity of MIF in human THP1 cells
In DepthDetails ArticlePubMed