BDBM50298361 (R)-1-(6-chloro-5-fluoro-1H-indol-1-yl)propan-2-amine::CHEMBL574985
SMILES C[C@@H](N)Cn1ccc2cc(F)c(Cl)cc12
InChI Key InChIKey=XJJZQXUGLLXTHO-SSDOTTSWSA-N
Data  3 KI  1 EC50
  Tab Delimited (TSV)   2D SDfile   Computed 3D by Vconf -m prep SDfile
Find this compound or compounds like it in BindingDB:
Activity Spreadsheet -- Enzyme Inhibition Constant Data from BindingDB
Found 4 hits for monomerid = 50298361
Target5-hydroxytryptamine receptor 2C(Homo sapiens (Human))
Institute Of Science And Technology
Curated by ChEMBL
LigandPNGBDBM50298361((R)-1-(6-chloro-5-fluoro-1H-indol-1-yl)propan-2-am...)
Affinity DataKi:  1nM. Assay description: Binding affinity to 5-HT2C receptor
In DepthDetails ArticlePubMed
Target5-hydroxytryptamine receptor 2C(Homo sapiens (Human))
Institute Of Science And Technology
Curated by ChEMBL
LigandPNGBDBM50298361((R)-1-(6-chloro-5-fluoro-1H-indol-1-yl)propan-2-am...)
Affinity DataKi:  10nM. Assay description: Binding affinity against human 5-hydroxytryptamine 2C receptor using displacement of [3H]DOB
In DepthDetails ArticlePubMed
Target5-hydroxytryptamine receptor 2A(Homo sapiens (Human))
F. Hoffmann-La Roche
Curated by ChEMBL
LigandPNGBDBM50298361((R)-1-(6-chloro-5-fluoro-1H-indol-1-yl)propan-2-am...)
Affinity DataKi:  79nM. Assay description: Binding affinity against human 5-hydroxytryptamine 2A receptor using displacement of [3H]5-HT
In DepthDetails ArticlePubMed
Target5-hydroxytryptamine receptor 2C(Rattus norvegicus (Rat))
F. Hoffmann-La Roche
Curated by ChEMBL
LigandPNGBDBM50298361((R)-1-(6-chloro-5-fluoro-1H-indol-1-yl)propan-2-am...)
Affinity DataEC50:  3.16E+3nM. Assay description: Efficacy (pEC50) was evaluated for 5-HT2C receptor-mediated stimulation of IP3 formation in vitro in choroid plexus of the rat
In DepthDetails ArticlePubMed