BDBM50298467 (S)-1-(3-fluorophenyl)-3-(5-(3-methyl-1H-pyrazolo[3,4-c]pyridin-5-yl)pyridin-3-yloxy)propan-2-amine::CHEMBL573592
SMILES Cc1n[nH]c2cnc(cc12)-c1cncc(OC[C@@H](N)Cc2cccc(F)c2)c1
InChI Key InChIKey=OXYFHDIOBFTPQV-KRWDZBQOSA-N
Data  1 IC50
  Tab Delimited (TSV)   2D SDfile   Computed 3D by Vconf -m prep SDfile
Find this compound or compounds like it in BindingDB:
Activity Spreadsheet -- Enzyme Inhibition Constant Data from BindingDB
Found 1 hit for monomerid = 50298467
TargetRAC-alpha serine/threonine-protein kinase(Homo sapiens (Human))
Zhejiang University
Curated by ChEMBL
LigandPNGBDBM50298467((S)-1-(3-fluorophenyl)-3-(5-(3-methyl-1H-pyrazolo[...)
Affinity DataIC50:  8.40nM. Assay description: Inhibition of Akt
In DepthDetails ArticlePubMed