BDBM50298468 (S)-1-mesityl-3-(5-(3-methyl-1H-pyrazolo[3,4-c]pyridin-5-yl)pyridin-3-yloxy)propan-2-amine::CHEMBL572417
SMILES Cc1n[nH]c2cnc(cc12)-c1cncc(OC[C@@H](N)Cc2c(C)cc(C)cc2C)c1
InChI Key InChIKey=LKGYOMNCBCJAAC-IBGZPJMESA-N
Data  1 IC50
  Tab Delimited (TSV)   2D SDfile   Computed 3D by Vconf -m prep SDfile
Find this compound or compounds like it in BindingDB:
Activity Spreadsheet -- Enzyme Inhibition Constant Data from BindingDB
Found 1 hit for monomerid = 50298468
TargetRAC-alpha serine/threonine-protein kinase(Homo sapiens (Human))
Zhejiang University
Curated by ChEMBL
LigandPNGBDBM50298468((S)-1-mesityl-3-(5-(3-methyl-1H-pyrazolo[3,4-c]pyr...)
Affinity DataIC50:  39nM. Assay description: Inhibition of Akt
In DepthDetails ArticlePubMed