BDBM50298557 5-[(Diphenylmethyl)carbonyl]amino-8-methyl-2-(2-furyl)-pyrazolo[4,3-e]1,2,4-triazolo[1,5-c]pyrimidine::CHEMBL578224
SMILES Cn1cc2c(n1)nc(NC(=O)C(c1ccccc1)c1ccccc1)n1nc(nc21)-c1ccco1
InChI Key InChIKey=ZIPKODOOTJSIEO-UHFFFAOYSA-N
Data  3 KI  1 IC50
  Tab Delimited (TSV)   2D SDfile   Computed 3D by Vconf -m prep SDfile
Find this compound or compounds like it in BindingDB:
Activity Spreadsheet -- Enzyme Inhibition Constant Data from BindingDB
Found 4 hits for monomerid = 50298557
TargetAdenosine receptor A3(Homo sapiens (Human))
Universit£
Curated by ChEMBL
LigandPNGBDBM50298557(5-[(Diphenylmethyl)carbonyl]amino-8-methyl-2-(2-fu...)
Affinity DataKi:  0.25nM. Assay description: Displacement of [3H]NECA from human adenosine A3 receptor expressed in CHO cellsChecked by Author
In DepthDetails ArticlePubMed
TargetAdenosine receptor A1(Homo sapiens (Human))
Universit£
Curated by ChEMBL
LigandPNGBDBM50298557(5-[(Diphenylmethyl)carbonyl]amino-8-methyl-2-(2-fu...)
Affinity DataKi:  139nM. Assay description: Displacement of [3H]CCPA from human adenosine A1 receptor expressed in CHO cellsChecked by Author
In DepthDetails ArticlePubMed
TargetAdenosine receptor A2a(Homo sapiens (Human))
Universit£
Curated by ChEMBL
LigandPNGBDBM50298557(5-[(Diphenylmethyl)carbonyl]amino-8-methyl-2-(2-fu...)
Affinity DataKi:  216nM. Assay description: Displacement of [3H]NECA from human adenosine A2A receptor expressed in CHO cellsChecked by Author
In DepthDetails ArticlePubMed
TargetAdenosine receptor A2b(Homo sapiens (Human))
Universit£
Curated by ChEMBL
LigandPNGBDBM50298557(5-[(Diphenylmethyl)carbonyl]amino-8-methyl-2-(2-fu...)
Affinity DataIC50:  363nM. Assay description: Antagonist activity at human adenosine A2B receptor expressed in CHO cells assessed as inhibition of NECA-induced adenylyl cyclase activityChecked by Author
In DepthDetails ArticlePubMed