BDBM50298620 CHEMBL576941::N-(4-Methoxy-1,3-benzothiazol-2-yl)-1-(methylsulfonyl)-1,2-dihydro-1'H-spiro[indole-3,4'-piperidine]-1'-carboxamide
SMILES COc1cccc2sc(NC(=O)N3CCC4(CN(c5ccccc45)S(C)(=O)=O)CC3)nc12
InChI Key InChIKey=GAUCTLITYHCUNI-UHFFFAOYSA-N
Data  1 IC50
  Tab Delimited (TSV)   2D SDfile   Computed 3D by Vconf -m prep SDfile
Find this compound or compounds like it in BindingDB:
Activity Spreadsheet -- Enzyme Inhibition Constant Data from BindingDB
Found 1 hit for monomerid = 50298620
TargetNeuropeptide Y receptor type 5(Homo sapiens (Human))
Tsukuba Research Institute
Curated by ChEMBL
LigandPNGBDBM50298620(CHEMBL576941 | N-(4-Methoxy-1,3-benzothiazol-2-yl)...)
Affinity DataIC50:  8.90nM. Assay description: Binding affinity to human neuropeptide Y5 receptor
In DepthDetails ArticlePubMed