BDBM50299002 (R)-3-((S)-2-((2-(2,6-dimethylphenoxy)acetamido)methyl)-2-hydroxy-4-phenylbutanoyl)-N-((1S,2R)-2-hydroxy-2,3-dihydro-1H-inden-1-yl)-5,5-dimethylthiazolidine-4-carboxamide::CHEMBL575149
SMILES Cc1cccc(C)c1OCC(=O)NC[C@@](O)(CCc1ccccc1)C(=O)N1CSC(C)(C)[C@H]1C(=O)N[C@@H]1[C@H](O)Cc2ccccc12
InChI Key InChIKey=BEPHSJYICUTSMY-FUYIFJRDSA-N
Data  3 KI
  Tab Delimited (TSV)   2D SDfile   Computed 3D by Vconf -m prep SDfile
Find this compound or compounds like it in BindingDB:
Activity Spreadsheet -- Enzyme Inhibition Constant Data from BindingDB
Found 3 hits for monomerid = 50299002
TargetPlasmepsin IV, putative(Plasmodium vivax)
Uppsala University
Curated by ChEMBL
LigandPNGBDBM50299002((R)-3-((S)-2-((2-(2,6-dimethylphenoxy)acetamido)me...)
Affinity DataKi:  370nM. Assay description: Inhibition of Plasmodium vivax plasmepsin 4 expressed in Escherichia coli BL21 (DE3) by fluorometric assay
In DepthDetails ArticlePubMed
TargetPlasmepsin II(Plasmodium falciparum)
Uppsala University
Curated by ChEMBL
LigandPNGBDBM50299002((R)-3-((S)-2-((2-(2,6-dimethylphenoxy)acetamido)me...)
Affinity DataKi:  1.40E+3nM. Assay description: Inhibition of Plasmodium falciparum plasmepsin 2 expressed in Escherichia coli BL21 (DE3) by fluorometric assay
In DepthDetails ArticlePubMed
TargetCathepsin D(Homo sapiens (Human))
Uppsala University
Curated by ChEMBL
LigandPNGBDBM50299002((R)-3-((S)-2-((2-(2,6-dimethylphenoxy)acetamido)me...)
Affinity DataKi: >1.00E+4nM. Assay description: Inhibition of human liver cathepsin D
In DepthDetails ArticlePubMed