BDBM50299177 (6aR,9R)-N9,N9-diethyl-N7-(pyridin-3-yl)-6,6a,8,9-tetrahydroindolo[4,3-fg]quinoline-7,9(4H)-dicarboxamide::CHEMBL573232
SMILES CCN(CC)C(=O)[C@H]1CN([C@@H]2Cc3c[nH]c4cccc(C2=C1)c34)C(=O)Nc1cccnc1
InChI Key InChIKey=KDYQLCOJSHGDEY-VGOFRKELSA-N
Data  2 IC50
  Tab Delimited (TSV)   2D SDfile   Computed 3D by Vconf -m prep SDfile
Find this compound or compounds like it in BindingDB:
Activity Spreadsheet -- Enzyme Inhibition Constant Data from BindingDB
Found 2 hits for monomerid = 50299177
TargetC-X-C chemokine receptor type 3(Homo sapiens (Human))
Novartis Institutes For Biomedical Research
Curated by ChEMBL
LigandPNGBDBM50299177((6aR,9R)-N9,N9-diethyl-N7-(pyridin-3-yl)-6,6a,8,9-...)
Affinity DataIC50:  285nM. Assay description: Displacement of [125I]I-TAC from human CXCR3 expressed in CHO cells by scintillation proximity assay
In DepthDetails ArticlePubMed
TargetC-X-C chemokine receptor type 3(Homo sapiens (Human))
Novartis Institutes For Biomedical Research
Curated by ChEMBL
LigandPNGBDBM50299177((6aR,9R)-N9,N9-diethyl-N7-(pyridin-3-yl)-6,6a,8,9-...)
Affinity DataIC50:  67nM. Assay description: Antagonist activity at human CXCR3 expressed in L1.2 cells assessed as inhibition of I-TAC-induced Ca2+ mobilization by FLIPR assay
In DepthDetails ArticlePubMed