BDBM50299611 (S)-N-(3-chlorophenyl)-N'-cyano-2-methyl-4-(5-methyl-7H-pyrrolo[2,3-d]pyrimidin-4-yl)piperazine-1-carboximidamide::CHEMBL570832
SMILES C[C@H]1CN(CCN1C(NC#N)=Nc1cccc(Cl)c1)c1ncnc2[nH]cc(C)c12
InChI Key InChIKey=XMIUKXIQHLXPBO-AWEZNQCLSA-N
Data  1 IC50
  Tab Delimited (TSV)   2D SDfile   Computed 3D by Vconf -m prep SDfile
Find this compound or compounds like it in BindingDB:
Activity Spreadsheet -- Enzyme Inhibition Constant Data from BindingDB
Found 1 hit for monomerid = 50299611
TargetLIM domain kinase 2(Homo sapiens (Human))
Lexicon Pharmaceuticals
Curated by ChEMBL
LigandPNGBDBM50299611((S)-N-(3-chlorophenyl)-N'-cyano-2-methyl-4-(5-meth...)
Affinity DataIC50:  1.60nM. Assay description: Inhibition of human recombinant LIMK2 expressed in baculovirus-Sf9 system by scintillation counting
In DepthDetails ArticlePubMed