BDBM50299657 3,3',3''-Thiene-2,3,5-triyltriphenol::CHEMBL576682
SMILES Oc1cccc(c1)-c1cc(c(s1)-c1cccc(O)c1)-c1cccc(O)c1
InChI Key InChIKey=ZBWIOPSLXQDYEV-UHFFFAOYSA-N
Data  3 IC50
  Tab Delimited (TSV)   2D SDfile   Computed 3D by Vconf -m prep SDfile
Find this compound or compounds like it in BindingDB:
Activity Spreadsheet -- Enzyme Inhibition Constant Data from BindingDB
Found 3 hits for monomerid = 50299657
Target17-beta-hydroxysteroid dehydrogenase type 2(Homo sapiens (Human))
Saarland University
Curated by ChEMBL
LigandPNGBDBM50299657(3,3',3''-Thiene-2,3,5-triyltriphenol | CHEMBL57668...)
Affinity DataIC50:  188nM. Assay description: Inhibition of human placental 17beta-HSD2 microsomal fraction using tritiated estradiol as substrate assessed as formation of estrone by HPLC analysi...
In DepthDetails ArticlePubMed
Target17-beta-hydroxysteroid dehydrogenase type 2(Homo sapiens (Human))
Saarland University
Curated by ChEMBL
LigandPNGBDBM50299657(3,3',3''-Thiene-2,3,5-triyltriphenol | CHEMBL57668...)
Affinity DataIC50:  188nM. Assay description: Inhibition of human placental 17betaHSD2 by radiodetection assay
In DepthDetails ArticlePubMed
Target17-beta-hydroxysteroid dehydrogenase type 1(Homo sapiens (Human))
Saarland University
Curated by ChEMBL
LigandPNGBDBM50299657(3,3',3''-Thiene-2,3,5-triyltriphenol | CHEMBL57668...)
Affinity DataIC50:  119nM. Assay description: Inhibition of human placental 17betaHSD1 by radiodetection assay
In DepthDetails ArticlePubMed