BDBM50299841 3-[3-(1H-Imidazol-1-yl)propyl]-2-thioxo-1,2,3,5,6,7-hexahydro-4H-cyclopenta[4,5]thieno[2,3-d]pyrimidin-4-one::CHEMBL565695
SMILES S=C1Nc2sc3CCCc3c2CN1CCCn1ccnc1
InChI Key InChIKey=MHBJKYOGBIAUFL-UHFFFAOYSA-N
Data  1 KI
  Tab Delimited (TSV)   2D SDfile   Computed 3D by Vconf -m prep SDfile
Find this compound or compounds like it in BindingDB:
Activity Spreadsheet -- Enzyme Inhibition Constant Data from BindingDB
Found 1 hit for monomerid = 50299841
TargetGlutaminyl-peptide cyclotransferase(Homo sapiens (Human))
Probiodrug
Curated by ChEMBL
LigandPNGBDBM50299841(3-[3-(1H-Imidazol-1-yl)propyl]-2-thioxo-1,2,3,5,6,...)
Affinity DataKi:  620nM. Assay description: Inhibition of human glutaminyl cyclase expressed in Pichia pastoris by pGAP coupled enzyme assay
In DepthDetails ArticlePubMed