BDBM50299895 5-hydroxy-8-(1-hydroxy-2-(2-methyl-1-(3-(trifluoromethyl)phenyl)propan-2-ylamino)ethyl)-2H-benzo[b][1,4]oxazin-3(4H)-one::CHEMBL568273
SMILES CC(C)(Cc1cccc(c1)C(F)(F)F)NCC(O)c1ccc(O)c2NC(=O)COc12
InChI Key InChIKey=XFHHEVKRJAUKQU-UHFFFAOYSA-N
Data  2 EC50
  Tab Delimited (TSV)   2D SDfile   Computed 3D by Vconf -m prep SDfile
Find this compound or compounds like it in BindingDB:
Activity Spreadsheet -- Enzyme Inhibition Constant Data from BindingDB
Found 2 hits for monomerid = 50299895
TargetBeta-1 adrenergic receptor(Homo sapiens (Human))
Boehringer Ingelheim Pharma
Curated by ChEMBL
LigandPNGBDBM50299895(5-hydroxy-8-(1-hydroxy-2-(2-methyl-1-(3-(trifluoro...)
Affinity DataEC50:  3.70nM. Assay description: Agonist activity at human adrenergic beta 1 expressed in CHO-K1 cells assessed as intracellular cAMP accumulation
In DepthDetails ArticlePubMed
TargetBeta-2 adrenergic receptor(Homo sapiens (Human))
Boehringer Ingelheim Pharma
Curated by ChEMBL
LigandPNGBDBM50299895(5-hydroxy-8-(1-hydroxy-2-(2-methyl-1-(3-(trifluoro...)
Affinity DataEC50:  0.600nM. Assay description: Agonist activity at human adrenergic beta 2 expressed in CHO-K1 cells assessed as intracellular cAMP accumulation
In DepthDetails ArticlePubMed