BDBM50299923 1-(Pent-4-enoyl)-(3S)-3-[1(R)-(biphenylacetyloxy)-ethyl]-azetidin-2-one::CHEMBL570127
SMILES C[C@@H](OC(=O)Cc1ccc(cc1)-c1ccccc1)[C@@H]1CN(C(=O)CCC=C)C1=O
InChI Key InChIKey=DXEIVYGUSNQVQA-UTKZUKDTSA-N
Data  2 IC50
  Tab Delimited (TSV)   2D SDfile   Computed 3D by Vconf -m prep SDfile
Find this compound or compounds like it in BindingDB:
Activity Spreadsheet -- Enzyme Inhibition Constant Data from BindingDB
Found 2 hits for monomerid = 50299923
TargetMonoglyceride lipase(Homo sapiens (Human))
Universite Catholique De Louvain
Curated by ChEMBL
LigandPNGBDBM50299923(1-(Pent-4-enoyl)-(3S)-3-[1(R)-(biphenylacetyloxy)-...)
Affinity DataIC50:  1.84E+3nM. Assay description: Inhibition of human recombinant MGL using 2-oleoylglycerol by competitive hydrolysis assay
In DepthDetails ArticlePubMed
TargetFatty-acid amide hydrolase 1(Homo sapiens (Human))
Universite Catholique De Louvain
Curated by ChEMBL
LigandPNGBDBM50299923(1-(Pent-4-enoyl)-(3S)-3-[1(R)-(biphenylacetyloxy)-...)
Affinity DataIC50:  12nM. Assay description: Inhibition of human recombinant FAAH using [3H]anandamide by competitive hydrolysis assay
In DepthDetails ArticlePubMed