BDBM50300205 7,8-Dimethoxy-5-methyl-1H-benzo[e]isoindole-1,3(2H)-dione::CHEMBL571486
SMILES COc1cc2c3C(=O)NC(=O)c3cc(C)c2cc1OC
InChI Key InChIKey=DVMFNLSFJGRPMS-UHFFFAOYSA-N
Data  1 KI  3 IC50
  Tab Delimited (TSV)   2D SDfile   Computed 3D by Vconf -m prep SDfile
Find this compound or compounds like it in BindingDB:
Activity Spreadsheet -- Enzyme Inhibition Constant Data from BindingDB
Found 4 hits for monomerid = 50300205
TargetGlycogen synthase kinase-3 beta(Homo sapiens (Human))
Peking University
Curated by ChEMBL
LigandPNGBDBM50300205(7,8-Dimethoxy-5-methyl-1H-benzo[e]isoindole-1,3(2H...)
Affinity DataKi:  259nM. Assay description: Inhibition of human recombinant GSK3-beta at 1 uM by ATP competitive assay
In DepthDetails ArticlePubMed
TargetCyclin-A1/Cyclin-A2/Cyclin-dependent kinase 2(Homo sapiens (Human))
Peking University
Curated by ChEMBL
LigandPNGBDBM50300205(7,8-Dimethoxy-5-methyl-1H-benzo[e]isoindole-1,3(2H...)
Affinity DataIC50:  787nM. Assay description: Inhibition of human CDK2/Cyclin A by ELISA
In DepthDetails ArticlePubMed
TargetGlycogen synthase kinase-3 beta(Homo sapiens (Human))
Peking University
Curated by ChEMBL
LigandPNGBDBM50300205(7,8-Dimethoxy-5-methyl-1H-benzo[e]isoindole-1,3(2H...)
Affinity DataIC50:  270nM. Assay description: Inhibition of human recombinant GSK3-beta
In DepthDetails ArticlePubMed
TargetGlycogen synthase kinase-3 beta(Homo sapiens (Human))
Peking University
Curated by ChEMBL
LigandPNGBDBM50300205(7,8-Dimethoxy-5-methyl-1H-benzo[e]isoindole-1,3(2H...)
Affinity DataIC50:  1.01E+3nMpH: 7.4Assay Description:Briefly, recombinant human GSK3β (1 然, 10 無) was mixed with 10 無 of GSK3β substrate (YRRAAVPPSPSLSRHSSPHQpSEDEEE, 100 然), 19 無 of 2.5 ...
In DepthDetails ArticlePubMed