BDBM50300213 2-(4-{[(3-Methoxyphenyl)amino]carbonothioyl}-1-piperazinyl)-8-ethyl-5-oxo-5,8-dihydropyrido[2,3-d]pyrimidine-6-carboxylic Acid::CHEMBL569865
SMILES CCn1cc(C(O)=O)c(=O)c2cnc(nc12)N1CCN(CC1)C(=S)Nc1cccc(OC)c1
InChI Key InChIKey=MCNCMGBOIQUDDP-UHFFFAOYSA-N
Data  1 IC50
  Tab Delimited (TSV)   2D SDfile   Computed 3D by Vconf -m prep SDfile
Find this compound or compounds like it in BindingDB:
Activity Spreadsheet -- Enzyme Inhibition Constant Data from BindingDB
Found 1 hit for monomerid = 50300213
TargetEctonucleotide pyrophosphatase/phosphodiesterase family member 2(Homo sapiens (Human))
The University Of Memphis
Curated by ChEMBL
LigandPNGBDBM50300213(2-(4-{[(3-Methoxyphenyl)amino]carbonothioyl}-1-pip...)
Affinity DataIC50:  1.77E+4nM. Assay description: Inhibition of human autotaxin isolated from MDA-MB-231 cells assessed as blockade of FS3 substrate hydrolysis by FRET assay
In DepthDetails ArticlePubMed