BDBM50300271 CHEMBL567224::N-(2-aminoethyl)-5-(6-(3-chlorobenzylamino)-9-((1S,2R,3S,4R,5R)-3,4-dihydroxybicyclo[3.1.0]hexan-2-yl)-9H-purin-2-yl)pent-4-ynamide
SMILES NCCNC(=O)CCC#Cc1nc(NCc2cccc(Cl)c2)c2ncn([C@@H]3[C@H]4C[C@H]4[C@@H](O)[C@H]3O)c2n1
InChI Key InChIKey=YYCYMPDHACASSW-ZVGWPWKESA-N
Data  2 KI
  Tab Delimited (TSV)   2D SDfile   Computed 3D by Vconf -m prep SDfile
Find this compound or compounds like it in BindingDB:
Activity Spreadsheet -- Enzyme Inhibition Constant Data from BindingDB
Found 2 hits for monomerid = 50300271
TargetAdenosine receptor A3(Homo sapiens (Human))
TBA
Curated by ChEMBL
LigandPNGBDBM50300271(CHEMBL567224 | N-(2-aminoethyl)-5-(6-(3-chlorobenz...)
Affinity DataKi:  404nM. Assay description: Displacement of [3H]I-AB-MECA from human recombinant adenosine A3 receptor expressed in CHO cells after 60 mins by liquid scintillation counting
In DepthDetails ArticlePubMed
TargetAdenosine receptor A3(Homo sapiens (Human))
TBA
Curated by ChEMBL
LigandPNGBDBM50300271(CHEMBL567224 | N-(2-aminoethyl)-5-(6-(3-chlorobenz...)
Affinity DataKi:  404nM. Assay description: Displacement of [125I]AB-MECA from human recombinant adenosine A3 receptor expressed in CHO cells after 60 mins by liquid scintillation counting
In DepthDetails ArticlePubMed