BDBM50300278 (1'S,2'R,3'S,4'S,5'S)-4'-[6-(3-Chlorobenzylamino)-2-(N-cyanine(beta-aminoethylaminocarbonyl)-1-butynyl)-9-yl]-2',3'-dihydroxybicyclo[3.1.0]hexane-1'-carboxylic Acid N-Methylamide::CHEMBL574212
SMILES CCN1\C(=C/C=C/C=C/C2=[N+](CCCCCC(=O)NCCNC(=O)CCC#Cc3nc(NCc4cccc(Cl)c4)c4ncn([C@@H]5[C@H]6C[C@@]6([C@@H](O)[C@H]5O)C(=O)NC)c4n3)c3ccccc3C2(C)C)C(C)(C)c2cc(ccc12)S([O-])(=O)=O
InChI Key InChIKey=BJRYADSSKIBSOD-HMXAIGQHSA-N
Data  3 KI  1 IC50
  Tab Delimited (TSV)   2D SDfile   Computed 3D by Vconf -m prep SDfile
Find this compound or compounds like it in BindingDB:
Activity Spreadsheet -- Enzyme Inhibition Constant Data from BindingDB
Found 4 hits for monomerid = 50300278
TargetAdenosine receptor A3(Rattus norvegicus)
National Institute Of Diabetes And Digestive And Kidney Diseases
Curated by ChEMBL
LigandPNGBDBM50300278((1'S,2'R,3'S,4'S,5'S)-4'-[6-(3-Chlorobenzylamino)-...)
Affinity DataKi:  9.62nM. Assay description: Binding affinity to rat adenosine A3 receptor expressed in CHO cells
In DepthDetails ArticlePubMed
TargetAdenosine receptor A3(Homo sapiens (Human))
National Institute Of Diabetes And Digestive And Kidney Diseases
Curated by ChEMBL
LigandPNGBDBM50300278((1'S,2'R,3'S,4'S,5'S)-4'-[6-(3-Chlorobenzylamino)-...)
Affinity DataKi:  17.2nM. Assay description: Displacement of [125I]AB-MECA from human recombinant adenosine A3 receptor expressed in CHO cells after 60 mins by liquid scintillation counting
In DepthDetails ArticlePubMed
TargetAdenosine receptor A2a(Homo sapiens (Human))
National Institute Of Diabetes And Digestive And Kidney Diseases
Curated by ChEMBL
LigandPNGBDBM50300278((1'S,2'R,3'S,4'S,5'S)-4'-[6-(3-Chlorobenzylamino)-...)
Affinity DataKi:  4.73E+3nM. Assay description: Displacement of [3H]CGS21680 from human adenosine A2A receptor expressed in HEK293 cells after 60 mins by liquid scintillation counting
In DepthDetails ArticlePubMed
TargetAdenosine receptor A3(Homo sapiens (Human))
National Institute Of Diabetes And Digestive And Kidney Diseases
Curated by ChEMBL
LigandPNGBDBM50300278((1'S,2'R,3'S,4'S,5'S)-4'-[6-(3-Chlorobenzylamino)-...)
Affinity DataIC50:  1.09nM. Assay description: Agonist activity at human recombinant adenosine A3 receptor expressed in CHO cells assessed as inhibition of forskolin-stimulated cAMP production tre...
In DepthDetails ArticlePubMed