BDBM50300363 CHEMBL583426::Tyr-D-Ala-Gly-NMePhe
SMILES C[C@@H](NC(=O)[C@@H](N)Cc1ccc(O)cc1)C(=O)NCC(=O)N(C)c1ccccc1
InChI Key InChIKey=OPRBFENCQHCQFV-KDOFPFPSSA-N
Data  1 IC50
  Tab Delimited (TSV)   2D SDfile   Computed 3D by Vconf -m prep SDfile
Find this compound or compounds like it in BindingDB:
Activity Spreadsheet -- Enzyme Inhibition Constant Data from BindingDB
Found 1 hit for monomerid = 50300363
TargetMu-type opioid receptor(Rattus norvegicus (rat))
The University Of Kansas
Curated by ChEMBL
LigandPNGBDBM50300363(CHEMBL583426 | Tyr-D-Ala-Gly-NMePhe)
Affinity DataIC50:  1.00E+3nM. Assay description: Inhibition of [3H]naloxone binding to mu opioid receptor in rat brain membrane
In DepthDetails ArticlePubMed