BDBM50300398 5-chloro-N4-(2-(isopropylsulfonyl)phenyl)-N2-(2-methoxy-4-nitrophenyl)pyrimidine-2,4-diamine::CHEMBL575046
SMILES COc1cc(ccc1Nc1ncc(Cl)c(Nc2ccccc2S(=O)(=O)C(C)C)n1)[N+]([O-])=O
InChI Key InChIKey=BCCAOEMMLTWKQG-UHFFFAOYSA-N
Data  1 IC50
  Tab Delimited (TSV)   2D SDfile   Computed 3D by Vconf -m prep SDfile
Find this compound or compounds like it in BindingDB:
Activity Spreadsheet -- Enzyme Inhibition Constant Data from BindingDB
Found 1 hit for monomerid = 50300398
TargetTyrosine-protein kinase ZAP-70(Homo sapiens (Human))
Gvk Biosciences
Curated by ChEMBL
LigandPNGBDBM50300398(5-chloro-N4-(2-(isopropylsulfonyl)phenyl)-N2-(2-me...)
Affinity DataIC50:  3.00E+3nM. Assay description: Inhibition of human GST-fused ZAP-70 expressed in Sf9 cells
In DepthDetails ArticlePubMed