BDBM50300411 (S)-3,4,5-Trihydroxy-N-(1-(2-(hydroxyamino)-2-oxoethyl)-2,6-dioxopiperidin-3-yl)benzamide::CHEMBL575029
SMILES ONC(=O)CN1C(=O)CC[C@H](NC(=O)c2cc(O)c(O)c(O)c2)C1=O
InChI Key InChIKey=VKMSYYVXWGESJB-ZETCQYMHSA-N
Data  1 IC50
  Tab Delimited (TSV)   2D SDfile   Computed 3D by Vconf -m prep SDfile
Find this compound or compounds like it in BindingDB:
Activity Spreadsheet -- Enzyme Inhibition Constant Data from BindingDB
Found 1 hit for monomerid = 50300411
TargetAminopeptidase N(Sus scrofa (Pig))
Shandong University
Curated by ChEMBL
LigandPNGBDBM50300411((S)-3,4,5-Trihydroxy-N-(1-(2-(hydroxyamino)-2-oxoe...)
Affinity DataIC50:  4.30E+3nM. Assay description: Inhibition of pig kidney microsomes aminopeptidase N preincubated for 30 mins
In DepthDetails ArticlePubMed