BDBM50300413 (S)-2-(2-((S)-2,6-Dioxo-3-(3,4,5-trihydroxybenzamido)piperidin-1-yl)acetamido)-4-methylpentanoic acid::CHEMBL575053
SMILES CC(C)C[C@H](NC(=O)CN1C(=O)CC[C@H](NC(=O)c2cc(O)c(O)c(O)c2)C1=O)C(O)=O
InChI Key InChIKey=XPYILMGOCNSRKF-RYUDHWBXSA-N
Data  1 IC50
  Tab Delimited (TSV)   2D SDfile   Computed 3D by Vconf -m prep SDfile
Find this compound or compounds like it in BindingDB:
Activity Spreadsheet -- Enzyme Inhibition Constant Data from BindingDB
Found 1 hit for monomerid = 50300413
TargetAminopeptidase N(Sus scrofa (Pig))
Shandong University
Curated by ChEMBL
LigandPNGBDBM50300413((S)-2-(2-((S)-2,6-Dioxo-3-(3,4,5-trihydroxybenzami...)
Affinity DataIC50:  5.54E+4nM. Assay description: Inhibition of pig kidney microsomes aminopeptidase N preincubated for 30 mins
In DepthDetails ArticlePubMed