BDBM50300522 (1S,2R)-1-(5-chloro-1H-indol-1-yl)-1-(3-fluorophenyl)-3-(methylamino)propan-2-ol::CHEMBL566958
SMILES CNC[C@@H](O)[C@H](c1cccc(F)c1)n1ccc2cc(Cl)ccc12
InChI Key InChIKey=MYBQVBFITHURNS-MSOLQXFVSA-N
Data  2 IC50
  Tab Delimited (TSV)   2D SDfile   Computed 3D by Vconf -m prep SDfile
Find this compound or compounds like it in BindingDB:
Activity Spreadsheet -- Enzyme Inhibition Constant Data from BindingDB
Found 2 hits for monomerid = 50300522
TargetSodium-dependent noradrenaline transporter(Homo sapiens (Human))
Wyeth Research
Curated by ChEMBL
LigandPNGBDBM50300522((1S,2R)-1-(5-chloro-1H-indol-1-yl)-1-(3-fluorophen...)
Affinity DataIC50:  60nM. Assay description: Inhibition of human NET expressed in MDCK-Net6 cells
In DepthDetails ArticlePubMed
TargetSodium-dependent serotonin transporter(Homo sapiens (Human))
Wyeth Research
Curated by ChEMBL
LigandPNGBDBM50300522((1S,2R)-1-(5-chloro-1H-indol-1-yl)-1-(3-fluorophen...)
Affinity DataIC50:  79nM. Assay description: Inhibition of human SERT expressed in JAR cells
In DepthDetails ArticlePubMed