BDBM50300762 4,4'-(5-fluoro-1,3-phenylene)bis(3-cyano-1,2,5-oxadiazole 2-oxide)::CHEMBL570121
SMILES [O-][n+]1onc(c1C#N)-c1cc(F)cc(c1)-c1no[n+]([O-])c1C#N
InChI Key InChIKey=VUWFBWLIFIYXLD-UHFFFAOYSA-N
Data  1 IC50
  Tab Delimited (TSV)   2D SDfile   Computed 3D by Vconf -m prep SDfile
Find this compound or compounds like it in BindingDB:
Activity Spreadsheet -- Enzyme Inhibition Constant Data from BindingDB
Found 1 hit for monomerid = 50300762
TargetThioredoxin glutathione reductase(Schistosoma mansoni)
National Human Genome Research Institute
Curated by ChEMBL
LigandPNGBDBM50300762(4,4'-(5-fluoro-1,3-phenylene)bis(3-cyano-1,2,5-oxa...)
Affinity DataIC50:  480nM. Assay description: Inhibition of Schistosoma mansoni TGR
In DepthDetails ArticlePubMed