BDBM50301329 5-chloro-6-(4-((2S)-1-(4-chlorobenzyl)-2-methylpiperidin-4-yl)piperazin-1-yl)-N-(3,4-dichlorobenzyl)nicotinamide::CHEMBL570734
SMILES C[C@H]1CC(CCN1Cc1ccc(Cl)cc1)N1CCN(CC1)c1ncc(cc1Cl)C(=O)NCc1ccc(Cl)c(Cl)c1
InChI Key InChIKey=PRPPWWOPQVJUNZ-JINQPTGOSA-N
Data  1 KI
  Tab Delimited (TSV)   2D SDfile   Computed 3D by Vconf -m prep SDfile
Find this compound or compounds like it in BindingDB:
Activity Spreadsheet -- Enzyme Inhibition Constant Data from BindingDB
Found 1 hit for monomerid = 50301329
TargetC-X-C chemokine receptor type 3(Homo sapiens (Human))
Ligand Pharmaceuticals
Curated by ChEMBL
LigandPNGBDBM50301329(5-chloro-6-(4-((2S)-1-(4-chlorobenzyl)-2-methylpip...)
Affinity DataKi:  16nM. Assay description: Displacement of 125I-IP10 from recombinant human CXCR3 receptor expressed in Ba/F3 cell membrane after 1 to 4 hrs by scintillation counting
In DepthDetails ArticlePubMed